{"text_format":"1","workbook":"xlsx","n_sheets":5,"sheets":["Übersicht","Spiegel","1A_HV","1A_M","1B"],"not_rendered":{"charts":2,"images":0,"macros":1,"external_links":0,"defined_names":0,"comments":0,"pivot_tables":0},"unopened":[],"bounds":{"document_bytes":16777216,"sheet_cells":100000,"rows_first":2000,"rows_last":500,"rows_between":2000,"halvings":0,"cell_chars":16384,"cell_head_chars":4096},"cells_cut":0,"cells_raw":0,"read":"whole","date_system":"1900"}

{"sheet":"Übersicht","index":0,"n_rows":84,"n_cols":32,"rows_kept":84,"cut":false,"hidden":false,"merged":[[7,15,7,17],[3,10,3,18],[4,10,4,18],[5,10,5,18],[6,10,6,18],[30,26,31,26],[32,26,33,26],[34,26,35,26],[36,26,37,26],[8,26,8,31],[9,26,10,26],[11,26,12,26],[14,26,15,26],[16,26,17,26],[18,26,19,26],[20,26,21,26],[22,26,23,26],[11,27,12,27],[9,27,10,27],[9,28,10,28],[11,28,12,28],[18,29,19,29],[18,30,19,30],[18,31,19,31],[16,27,17,27],[16,28,17,28],[16,29,17,29],[16,30,17,30],[16,31,17,31],[11,9,12,9],[11,10,12,10],[9,7,9,9],[8,7,8,18],[8,20,8,24],[8,1,8,5],[9,1,9,5],[10,1,10,5],[11,1,11,5],[11,21,12,21],[9,20,10,20],[9,21,10,21],[9,16,9,18],[11,15,12,15],[9,13,9,15],[9,10,9,12],[11,13,12,13],[11,7,12,7],[11,11,12,11],[11,8,12,8],[11,14,12,14],[11,12,12,12],[11,20,12,20],[1,1,1,31],[3,7,3,9],[4,7,4,9],[5,7,5,9],[6,7,6,9],[5,20,5,24],[4,20,4,24],[3,20,3,24],[6,20,6,24],[3,25,3,31],[4,25,4,31],[5,25,5,31],[6,25,6,31],[4,2,5,4],[14,1,15,1],[14,27,15,27],[14,2,15,2],[14,3,15,3],[14,28,15,28],[14,29,15,29],[14,30,15,30],[14,31,15,31],[22,27,23,27],[22,28,23,28],[22,29,23,29],[22,30,23,30],[22,31,23,31],[16,3,17,3],[16,2,17,2],[22,1,23,1],[22,2,23,2],[22,3,23,3],[16,1,17,1],[18,1,19,1],[18,2,19,2],[18,3,19,3],[20,1,21,1],[20,2,21,2],[20,3,21,3],[20,27,21,27],[20,28,21,28],[20,29,21,29],[20,30,21,30],[20,31,21,31],[18,27,19,27],[18,28,19,28],[24,29,25,29],[24,30,25,30],[24,31,25,31],[24,26,25,26],[26,1,27,1],[26,2,27,2],[26,3,27,3],[26,27,27,27],[26,28,27,28],[26,29,27,29],[26,30,27,30],[26,31,27,31],[24,1,25,1],[24,2,25,2],[24,3,25,3],[24,27,25,27],[24,28,25,28],[26,26,27,26],[28,29,29,29],[28,30,29,30],[28,31,29,31],[30,1,31,1],[30,2,31,2],[30,3,31,3],[30,27,31,27],[30,28,31,28],[30,29,31,29],[30,30,31,30],[30,31,31,31],[28,1,29,1],[28,2,29,2],[28,3,29,3],[28,27,29,27],[28,28,29,28],[28,26,29,26],[32,29,33,29],[32,30,33,30],[32,31,33,31],[34,1,35,1],[34,2,35,2],[34,3,35,3],[34,27,35,27],[34,28,35,28],[34,29,35,29],[34,30,35,30],[34,31,35,31],[32,1,33,1],[32,2,33,2],[32,3,33,3],[32,27,33,27],[32,28,33,28],[36,29,37,29],[36,30,37,30],[36,31,37,31],[38,1,39,1],[38,2,39,2],[38,3,39,3],[38,27,39,27],[38,28,39,28],[38,29,39,29],[38,30,39,30],[38,31,39,31],[36,1,37,1],[36,2,37,2],[36,3,37,3],[36,27,37,27],[36,28,37,28],[38,26,39,26],[40,29,41,29],[40,30,41,30],[40,31,41,31],[42,1,43,1],[42,2,43,2],[42,3,43,3],[42,27,43,27],[42,28,43,28],[42,29,43,29],[42,30,43,30],[42,31,43,31],[40,1,41,1],[40,2,41,2],[40,3,41,3],[40,27,41,27],[40,28,41,28],[40,26,41,26],[42,26,43,26],[44,29,45,29],[44,30,45,30],[44,31,45,31],[46,1,47,1],[46,2,47,2],[46,3,47,3],[46,27,47,27],[46,28,47,28],[46,29,47,29],[46,30,47,30],[46,31,47,31],[44,1,45,1],[44,2,45,2],[44,3,45,3],[44,27,45,27],[44,28,45,28],[44,26,45,26],[46,26,47,26],[48,29,49,29],[48,30,49,30],[48,31,49,31],[50,1,51,1],[50,2,51,2],[50,3,51,3],[50,27,51,27],[50,28,51,28],[50,29,51,29],[50,30,51,30],[50,31,51,31],[48,1,49,1],[48,2,49,2],[48,3,49,3],[48,27,49,27],[48,28,49,28],[48,26,49,26],[50,26,51,26],[52,29,53,29],[52,30,53,30],[52,31,53,31],[54,1,55,1],[54,2,55,2],[54,3,55,3],[54,27,55,27],[54,28,55,28],[54,29,55,29],[54,30,55,30],[54,31,55,31],[52,1,53,1],[52,2,53,2],[52,3,53,3],[52,27,53,27],[52,28,53,28],[52,26,53,26],[54,26,55,26],[56,29,57,29],[56,30,57,30],[56,31,57,31],[58,1,59,1],[58,2,59,2],[58,3,59,3],[58,27,59,27],[58,28,59,28],[58,29,59,29],[58,30,59,30],[58,31,59,31],[56,1,57,1],[56,2,57,2],[56,3,57,3],[56,27,57,27],[56,28,57,28],[56,26,57,26],[58,26,59,26],[60,29,61,29],[60,30,61,30],[60,31,61,31],[62,1,63,1],[62,2,63,2],[62,3,63,3],[62,27,63,27],[62,28,63,28],[62,29,63,29],[62,30,63,30],[62,31,63,31],[60,1,61,1],[60,2,61,2],[60,3,61,3],[60,27,61,27],[60,28,61,28],[60,26,61,26],[62,26,63,26],[64,29,65,29],[64,30,65,30],[64,31,65,31],[66,1,67,1],[66,2,67,2],[66,3,67,3],[66,27,67,27],[66,28,67,28],[66,29,67,29],[66,30,67,30],[66,31,67,31],[64,1,65,1],[64,2,65,2],[64,3,65,3],[64,27,65,27],[64,28,65,28],[64,26,65,26],[66,26,67,26],[68,29,69,29],[68,30,69,30],[68,31,69,31],[70,1,71,1],[70,2,71,2],[70,3,71,3],[70,27,71,27],[70,28,71,28],[70,29,71,29],[70,30,71,30],[70,31,71,31],[68,1,69,1],[68,2,69,2],[68,3,69,3],[68,27,69,27],[68,28,69,28],[68,26,69,26],[70,26,71,26],[72,29,73,29],[72,30,73,30],[72,31,73,31],[74,1,75,1],[74,2,75,2],[74,3,75,3],[74,27,75,27],[74,28,75,28],[74,29,75,29],[74,30,75,30],[74,31,75,31],[72,1,73,1],[72,2,73,2],[72,3,73,3],[72,27,73,27],[72,28,73,28],[74,26,75,26],[72,26,73,26],[76,26,77,26],[76,29,77,29],[76,30,77,30],[76,31,77,31],[78,1,79,1],[78,2,79,2],[78,3,79,3],[78,27,79,27],[78,28,79,28],[78,29,79,29],[78,30,79,30],[78,31,79,31],[76,1,77,1],[76,2,77,2],[76,3,77,3],[76,27,77,27],[76,28,77,28],[78,26,79,26],[80,26,81,26],[80,29,81,29],[80,30,81,30],[80,31,81,31],[82,1,83,1],[82,2,83,2],[82,3,83,3],[82,27,83,27],[82,28,83,28],[82,29,83,29],[82,30,83,30],[82,31,83,31],[80,1,81,1],[80,2,81,2],[80,3,81,3],[80,27,81,27],[80,28,81,28],[82,26,83,26]]}
[]
[null,"Bewertungsbogen"]
[]
[null,null,null,null,null,null,null,"Hörtext",null,null,null,null,null,null,null,null,null,null,null,null,"Klausurdatum"]
[null,null,"Eintragungen bitte nur in den gelben Feldern vornehmen!",null,null,null,null,"Mediationstext",null,null,null,null,null,null,null,null,null,null,null,null,"Korrekturdatum"]
[null,null,null,null,null,null,null,"Fiktionaler Text",null,null,null,null,null,null,null,null,null,null,null,null,"korrigierende Lehrkraft"]
[null,null,null,null,null,null,null,"Nicht-Fiktionaler Text"]
[null,null,null,null,null,null,null,null,null,null,null,null,null,"Version",null,"2022-10-29"]
[null,"Bereich",null,null,null,null,null,"Sprache",null,null,null,null,null,null,null,null,null,null,null,null,"Inhalt + Sprache",null,null,null,null,null,"Klausur"]
[null,"Aspekt",null,null,null,null,null,"Wortebene",null,null,"Satzebene",null,null,"Textebene",null,null,null,null,null,null,"Inhalt","Sprache",null,null,null,null,"Prüfungsteil A_HV","Prüfungsteil A_M","Prüfungsteil B"]
[null,"Kriterium",null,null,null,null,null,"Allgemeiner Wortschatz","Fachwortschatz, Funktions-wortschatz","Summe","Grammatische Strukturen","Satzbau und Satz-verknüpfungen, Idiomatik","Summe","Aufbau, Gedankenführung","aufgabenformat- typische Versprachlichung","Summe","Berechnet","Gerundet","Gegeben",null,null,null,"Berechnet","Gerundet","Gegeben",null,null,null,null,"Berechnet","Gerundet","Gegeben"]
[null,"Gewichtung / max. Punktzahl",null,null,null,null,null,0.5,0.5,0.3,0.5,0.5,0.4,0.5,0.5,{"$f":"100%-J12-M12","v":0.29999999999999993},null,null,null,null,0.4,{"$f":"100%-U12","v":0.6},null,null,null,null,0.2,0.25,{"$f":"100%-(AB12+AA12)","v":0.55000000000000004}]
[null,"Nr","Vorname","Nachname","Auswahlaufg.","A/B"]
[null,null,null,null,null,null,null,null,null,null,null,null,null,null,null,null,null,null,null,null,null,null,null,null,null,null,null,80]
[null,1,null,null,null,"A_M",null,{"$f":"IF($D$15=\"\",\"\",'1A_M'!$G$14)","v":""},{"$f":"IF($D$15=\"\",\"\",'1A_M'!$G$19)","v":""},{"$f":"IF(H15=\"\",\"\",$H$12*H15+$I$12*I15)","v":""},{"$f":"IF($D$15=\"\",\"\",'1A_M'!$G$25)","v":""},{"$f":"IF($D$15=\"\",\"\",'1A_M'!$G$31)","v":""},{"$f":"IF(K15=\"\",\"\",$K$12*K15+$L$12*L15)","v":""},{"$f":"IF($D$15=\"\",\"\",'1A_M'!$G$40)","v":""},{"$f":"IF($D$15=\"\",\"\",'1A_M'!$G$46)","v":""},{"$f":"IF(N15=\"\",\"\",$N$12*N15+$O$12*O15)","v":""},{"$f":"IF(P15=\"\",\"\",$J$12*J15+$M$12*M15+$P$12*P15)","v":""},{"$f":"IF(Q15=\"\",\"\",ROUND(Q15,0))","v":""},{"$f":"IF($D$15=\"\",\"\",'1A_M'!$G$51)","v":""},null,{"$f":"IF($D$15=\"\",\"\",'1A_M'!$A$51)","v":""},{"$f":"IF($D$15=\"\",\"\",'1A_M'!$G$51)","v":""},{"$f":"IF(U15=\"\",\"\",$U$12*U15+$V$12*V15)","v":""},{"$f":"IF(W15=\"\",\"\",ROUND(W15,0))","v":""},{"$f":"IF($D$15=\"\",\"\",'1A_M'!$J$51)","v":""},null,{"$f":"IF(OR(D15=\"\",$AA$12=0),\"\",'1A_HV'!$C$9)","v":""},{"$f":"IF(OR(D15=\"\",$AB$12=0),\"\",'1A_HV'!$C$10)","v":""},{"$f":"IF(OR(D15=\"\",$AC$12=0),\"\",'1A_HV'!$C$11)","v":""},{"$f":"IF($D$15=\"\",\"\",'1A_HV'!$C$13)","v":""},{"$f":"IF($D$15=\"\",\"\",'1A_HV'!$C$14)","v":""},{"$f":"IF($D$15=\"\",\"\",'1A_HV'!$C$15)","v":""}]
[null,null,null,null,{"$f":"IF($D$15=\"\",\"\",IF('1B'!$A$6=\"Fiktionaler Text\",\"FT\",\"NFT\"))","v":""},"B",null,{"$f":"IF(D15=\"\",\"\",IF($AB$12<>1,'1B'!$G$15,\"-\"))","v":""},{"$f":"IF(D15=\"\",\"\",IF($AB$12<>1,'1B'!$G$20,\"-\"))","v":""},{"$f":"IF(H16=\"\",\"\",$H$12*H16+$I$12*I16)","v":""},{"$f":"IF(D15=\"\",\"\",IF($AB$12<>1,'1B'!$G$26,\"-\"))","v":""},{"$f":"IF(D15=\"\",\"\",IF($AB$12<>1,'1B'!$G$32,\"-\"))","v":""},{"$f":"IF(K16=\"\",\"\",$K$12*K16+$L$12*L16)","v":""},{"$f":"IF(D15=\"\",\"\",IF($AB$12<>1,'1B'!$G$41,\"-\"))","v":""},{"$f":"IF(D15=\"\",\"\",IF($AB$12<>1,'1B'!$G$47,\"-\"))","v":""},{"$f":"IF(N16=\"\",\"\",$N$12*N16+$O$12*O16)","v":""},{"$f":"IF(P16=\"\",\"\",$J$12*J16+$M$12*M16+$P$12*P16)","v":""},{"$f":"IF(Q16=\"\",\"\",ROUND(Q16,0))","v":""},{"$f":"IF(D15=\"\",\"\",IF($AB$12<>1,'1B'!$G$52,\"-\"))","v":""},null,{"$f":"IF(D15=\"\",\"\",'1B'!$A$52)","v":""},{"$f":"IF(D15=\"\",\"\",IF($AB$12<>1,'1B'!$G$52,\"-\"))","v":""},{"$f":"IF(U16=\"\",\"\",$U$12*U16+$V$12*V16)","v":""},{"$f":"IF(W16=\"\",\"\",ROUND(W16,0))","v":""},{"$f":"IF(D15=\"\",\"\",IF($AB$12<>1,'1B'!$J$52,\"-\"))","v":""}]
[null,2,null,null,null,"A_M",null,{"$f":"IF($D$17=\"\",\"\",#REF!)","v":""},{"$f":"IF($D$17=\"\",\"\",#REF!)","v":""},"",{"$f":"IF($D$17=\"\",\"\",#REF!)","v":""},{"$f":"IF($D$17=\"\",\"\",#REF!)","v":""},{"$f":"IF(K17=\"\",\"\",$K$12*K17+$L$12*L17)","v":""},{"$f":"IF($D$17=\"\",\"\",#REF!)","v":""},{"$f":"IF($D$17=\"\",\"\",#REF!)","v":""},{"$f":"IF(N17=\"\",\"\",$N$12*N17+$O$12*O17)","v":""},{"$f":"IF(P17=\"\",\"\",$J$12*J17+$M$12*M17+$P$12*P17)","v":""},{"$f":"IF(Q17=\"\",\"\",ROUND(Q17,0))","v":""},{"$f":"IF($D$17=\"\",\"\",#REF!)","v":""},null,{"$f":"IF($D$17=\"\",\"\",#REF!)","v":""},{"$f":"IF($D$17=\"\",\"\",#REF!)","v":""},{"$f":"IF(U17=\"\",\"\",$U$12*U17+$V$12*V17)","v":""},{"$f":"IF(W17=\"\",\"\",ROUND(W17,0))","v":""},{"$f":"IF($D$17=\"\",\"\",#REF!)","v":""},null,{"$f":"IF(OR(D17=\"\",$AA$12=0),\"\",#REF!)","v":""},{"$f":"IF(OR(D17=\"\",$AB$12=0),\"\",#REF!)","v":""},{"$f":"IF(OR(D17=\"\",$AC$12=0),\"\",#REF!)","v":""},{"$f":"IF($D$17=\"\",\"\",#REF!)","v":""},{"$f":"IF($D$17=\"\",\"\",#REF!)","v":""},{"$f":"IF($D$17=\"\",\"\",#REF!)","v":""}]
[null,null,null,null,{"$f":"IF($D$17=\"\",\"\",IF(#REF!=\"Fiktionaler Text\",\"FT\",\"NFT\"))","v":""},"B",null,{"$f":"IF(D17=\"\",\"\",IF($AB$12<>1,#REF!,\"-\"))","v":""},{"$f":"IF(D17=\"\",\"\",IF($AB$12<>1,#REF!,\"-\"))","v":""},"",{"$f":"IF(D17=\"\",\"\",IF($AB$12<>1,#REF!,\"-\"))","v":""},{"$f":"IF(D17=\"\",\"\",IF($AB$12<>1,#REF!,\"-\"))","v":""},"",{"$f":"IF(D17=\"\",\"\",IF($AB$12<>1,#REF!,\"-\"))","v":""},{"$f":"IF(D17=\"\",\"\",IF($AB$12<>1,#REF!,\"-\"))","v":""},"",{"$f":"IF(P18=\"\",\"\",$J$12*J18+$M$12*M18+$P$12*P18)","v":""},"",{"$f":"IF(D17=\"\",\"\",IF($AB$12<>1,#REF!,\"-\"))","v":""},null,{"$f":"IF(D17=\"\",\"\",#REF!)","v":""},{"$f":"IF(D17=\"\",\"\",IF($AB$12<>1,#REF!,\"-\"))","v":""},"","",{"$f":"IF(D17=\"\",\"\",IF($AB$12<>1,#REF!,\"-\"))","v":""}]
[null,3,null,null,null,"A_M",null,{"$f":"IF($D$19=\"\",\"\",#REF!)","v":""},{"$f":"IF($D$19=\"\",\"\",#REF!)","v":""},"",{"$f":"IF($D$19=\"\",\"\",#REF!)","v":""},{"$f":"IF($D$19=\"\",\"\",#REF!)","v":""},"",{"$f":"IF($D$19=\"\",\"\",#REF!)","v":""},{"$f":"IF($D$19=\"\",\"\",#REF!)","v":""},"","","",{"$f":"IF($D$19=\"\",\"\",#REF!)","v":""},null,{"$f":"IF($D$19=\"\",\"\",#REF!)","v":""},{"$f":"IF($D$19=\"\",\"\",#REF!)","v":""},"","",{"$f":"IF($D$19=\"\",\"\",#REF!)","v":""},null,{"$f":"IF(OR(D19=\"\",$AA$12=0),\"\",#REF!)","v":""},{"$f":"IF(OR(D19=\"\",$AB$12=0),\"\",#REF!)","v":""},{"$f":"IF(OR(D19=\"\",$AC$12=0),\"\",#REF!)","v":""},{"$f":"IF($D$19=\"\",\"\",#REF!)","v":""},{"$f":"IF($D$19=\"\",\"\",#REF!)","v":""},{"$f":"IF($D$19=\"\",\"\",#REF!)","v":""}]
[null,null,null,null,{"$f":"IF($D$19=\"\",\"\",IF(#REF!=\"Fiktionaler Text\",\"FT\",\"NFT\"))","v":""},"B",null,{"$f":"IF(D19=\"\",\"\",IF($AB$12<>1,#REF!,\"-\"))","v":""},{"$f":"IF(D19=\"\",\"\",IF($AB$12<>1,#REF!,\"-\"))","v":""},"",{"$f":"IF(D19=\"\",\"\",IF($AB$12<>1,#REF!,\"-\"))","v":""},{"$f":"IF(D19=\"\",\"\",IF($AB$12<>1,#REF!,\"-\"))","v":""},"",{"$f":"IF(D19=\"\",\"\",IF($AB$12<>1,#REF!,\"-\"))","v":""},{"$f":"IF(D19=\"\",\"\",IF($AB$12<>1,#REF!,\"-\"))","v":""},{"$f":"IF(N20=\"\",\"\",$N$12*N20+$O$12*O20)","v":""},"","",{"$f":"IF(D19=\"\",\"\",IF($AB$12<>1,#REF!,\"-\"))","v":""},null,{"$f":"IF(D19=\"\",\"\",#REF!)","v":""},{"$f":"IF(D19=\"\",\"\",IF($AB$12<>1,#REF!,\"-\"))","v":""},"","",{"$f":"IF(D19=\"\",\"\",IF($AB$12<>1,#REF!,\"-\"))","v":""}]
{"$rows_left_out":65}
{"sheet":"Spiegel","index":1,"n_rows":37,"n_cols":9,"rows_kept":37,"cut":false,"hidden":false,"merged":[[2,2,2,6],[10,5,10,6],[10,2,10,4],[36,2,36,4],[19,5,19,8],[36,5,36,8],[18,2,18,8],[21,8,23,8],[21,7,23,7],[24,8,26,8],[27,8,29,8],[30,8,32,8],[27,7,29,7],[33,8,35,8],[24,7,26,7],[33,7,35,7],[30,7,32,7]]}
[]
[]
[null,null,"Klausurspiegel Noten"]
[null,null,null,"Punkte","Note","Anzahl","Anteil"]
[null,null,null,0.5,"ungenügend",{"$f":"FREQUENCY(Übersicht!AF15:AF84,D5:D10)","v":0},{"$f":"F5/F$11","v":{"$error":"#DIV/0!"}}]
[null,null,null,3.5,"mangelhaft",0,{"$error":"#DIV/0!"}]
[null,null,null,6.5,"ausreichend",0,{"$error":"#DIV/0!"}]
[null,null,null,9.5,"befriedigend",0,{"$error":"#DIV/0!"}]
[null,null,null,12.5,"gut",0,{"$error":"#DIV/0!"}]
[null,null,null,15,"sehr gut",0,{"$error":"#DIV/0!"}]
[null,null,"Summe",null,null,{"$f":"SUM(F5:F10)","v":0}]
[]
[]
[]
[]
[]
[]
[]
[null,null,"Klausurspiegel Punkte"]
[null,null,"Prozent","Punkte","Note","Anzahl\ngegeben"]
{"$rows_left_out":18}
{"sheet":"1A_HV","index":2,"n_rows":26,"n_cols":13,"rows_kept":26,"cut":false,"hidden":false,"merged":[[1,10,1,13],[25,11,26,12],[25,10,26,10],[24,11,24,12],[23,11,23,12],[22,2,22,4],[2,2,2,4],[3,2,3,4],[8,3,8,4],[9,3,9,4],[10,3,10,4],[7,3,7,4],[14,0,15,1],[5,2,5,4],[18,2,18,4],[19,2,19,4],[14,2,15,2],[14,3,15,4]]}
["Übersicht",null,"Gesamtnote",null,null,null,null,null,null,"Bewertungsbogen für Prüfungsteil A: Hörverstehen"]
[null,null,null,null,null,null,null,null,null,"Hörtext",{"$f":"IF(Übersicht!K4=\"\",\"\",Übersicht!K4)","v":""}]
[null,"Vorname  ",{"$f":"Übersicht!C15","v":0},null,null,null,null,null,null,"Gewichtung",{"$f":"Übersicht!AA12","v":0.2}]
[null,"Name  ",{"$f":"Übersicht!D15","v":0}]
[null,null,null,null,null,null,null,null,null,null,null,null,"Max. Punktzahl"]
[null,"Klausurdatum  ",{"$f":"Übersicht!Z4","v":"00:00:00"}]
[]
[null,null,"Notenpunkte","Note",null,"Gewichtung"]
[null,"Prüfungsteil A_HV  ",{"$f":"IF(OR(L25=\"\",F9=0),\"\",L25)","v":""},{"$f":"IF(OR(C9=\"\",F9=0),\"\",VLOOKUP(C9,Spiegel!$D$21:$E$36,2))","v":""},null,{"$f":"Übersicht!AA12","v":0.2}]
[null,"Prüfungsteil A_M  ",{"$f":"IF(OR('1A_M'!J51=\"\",F10=0),\"\",'1A_M'!J51)","v":""},{"$f":"IF(OR(C10=\"\",F10=0),\"\",VLOOKUP(C10,Spiegel!$D$21:$E$36,2))","v":""},null,{"$f":"Übersicht!AB12","v":0.25}]
[null,"Prüfungsteil B  ",{"$f":"IF(OR('1B'!J52=\"\",F11=0),\"\",'1B'!J52)","v":""},{"$f":"IF(C11=\"\",\"\",VLOOKUP(C11,Spiegel!$D$21:$E$36,2))","v":""},null,{"$f":"Übersicht!AC12","v":0.55000000000000004}]
[]
[null,"Gesamt berechnet  ",{"$f":"IF(C9=\"\",$F$10*$C$10+$F$11*$C$11,IF(C10=\"\",$F$9*$C$9+$F$11*$C$11,IF(C11=\"\",$F$9*$C$9+$F$10*$C$10,$F$9*$C$9+$F$10*$C$10+$F$11*$C$11)))","v":{"$error":"#VALUE!"}}]
[null,"Gesamt gerundet  ",{"$f":"ROUND(C13,0)","v":{"$error":"#VALUE!"}}]
["Gesamt gegeben  ",null,null,{"$f":"IF(C15=\"\",\"\",VLOOKUP(C15,Spiegel!D21:E36,2))","v":""}]
[]
[]
[]
[null,"Korrektor  ",{"$f":"Übersicht!$Z$6","v":"00:00:00"}]
[null,"Korrekturdatum  ",{"$f":"Übersicht!$Z$5","v":"00:00:00"}]
{"$rows_left_out":7}
{"sheet":"1A_M","index":3,"n_rows":51,"n_cols":23,"rows_kept":51,"cut":false,"hidden":false,"merged":[[50,0,50,2],[40,22,44,24],[1,2,1,24],[6,0,7,2],[25,19,29,21],[25,22,29,24],[33,5,38,6],[33,7,38,9],[33,10,38,12],[33,13,38,15],[33,16,38,18],[33,19,38,21],[33,22,38,24],[25,10,29,12],[25,5,29,6],[25,7,29,9],[48,26,49,26],[30,22,30,24],[24,22,24,24],[21,10,23,12],[21,13,23,15],[21,16,23,18],[21,19,23,21],[21,22,23,24],[45,22,45,24],[48,10,50,12],[25,13,29,15],[25,16,29,18],[39,22,39,24],[3,16,3,23],[6,7,6,9],[6,16,6,18],[3,10,3,11],[6,19,6,21],[4,13,4,14],[3,13,3,14],[4,16,4,23],[6,13,6,15],[6,22,6,24],[3,8,3,9],[4,8,4,9],[6,10,6,12],[4,10,4,11],[7,22,7,24],[13,22,13,24],[9,10,12,12],[9,13,12,15],[14,10,17,12],[14,13,17,15],[14,16,17,18],[9,16,12,18],[6,4,7,4],[6,5,7,5],[9,4,19,4],[9,5,12,6],[9,7,12,9],[14,5,17,6],[14,7,17,9],[18,22,18,24],[9,19,12,21],[9,22,12,24],[14,19,17,21],[14,22,17,24],[49,0,49,2],[40,19,44,21],[21,4,31,4],[33,4,46,4],[21,5,23,6],[21,7,23,9],[40,5,44,6],[40,7,44,9],[46,1,46,2],[40,10,44,12],[40,13,44,15],[40,16,44,18],[48,0,48,2]]}
[]
["Übersicht",null,"Bewertungsbogen für Prüfungsteil A: Mediation/Sprachmittlung"]
[]
[null,null,null,null,null,null,"Gew.",null,"Vorname",null,"Name",null,null,"Klausurdatum",null,null,"Mediationstext"]
[null,null,null,null,null,null,{"$f":"Übersicht!AB12","v":0.25},null,{"$f":"IF(Übersicht!C15=\"\",\"\",Übersicht!C15)","v":""},null,{"$f":"IF(Übersicht!D15=\"\",\"\",Übersicht!D15)","v":""},null,null,{"$f":"IF(Übersicht!Z4=\"\",\"\",Übersicht!Z4)","v":""},null,null,{"$f":"IF(Übersicht!K5=\"\",\"\",Übersicht!K5)","v":""}]
[]
["Inhalt Mediation",null,null,null,"Aspekt","Gewicht","Note","sehr gut",null,null,"gut",null,null,"befriedigend",null,null,"ausreichend",null,null,"mangelhaft",null,null,"ungenügend"]
[null,null,null,null,null,null,"Punkte",15,14,13,12,11,10,9,8,7,6,5,4,3,2,1,0]
[]
[null,null,null,null,"Wortebene","Allgemeiner Wortschatz",null,"sehr differenziert, treffsicher und umfangreich, sehr hoher Grad an Korrektheit",null,null,"differenziert und meist treffend, hoher Grad an Korrektheit",null,null,"weniger differenziert bei vermehrter Fehlerzahl",null,null,"begrenzt, teils ungenau, recht hohe Fehlerzahl",null,null,"deutlich begrenzt, Verständlichkeit beeinträchtigt, hohe Fehlerzahl",null,null,"stark begrenzt,  Verständlichkeit erheblich beeinträchtigt, sehr hohe Fehlerzahl"]
[]
[]
[]
[null,null,null,null,null,{"$f":"Übersicht!H12","v":0.5},{"$f":"PUnkte(H14:Y14)","v":1},null,null,null,null,null,null,null,null,null,null,null,null,null,null,"x"]
[null,null,null,null,null,"Fachwortschatz, Funktions- wortschatz",null,"sehr differenziert, treffsicher und umfangreich, sehr hoher Grad an Korrektheit",null,null,"differenziert und meist treffend, hoher Grad an Korrektheit",null,null,"weniger differenziert bei vermehrter Fehlerzahl",null,null,"begrenzt, teils ungenau, recht hohe Fehlerzahl",null,null,"deutlich begrenzt, Verständlichkeit beeinträchtigt, hohe Fehlerzahl",null,null,"stark begrenzt,  Verständlichkeit erheblich beeinträchtigt, sehr hohe Fehlerzahl"]
[]
[]
[]
[null,null,null,null,null,{"$f":"Übersicht!I12","v":0.5},{"$f":"PUnkte(H19:Y19)","v":1},null,null,null,null,null,null,null,null,null,null,null,null,null,null,"x"]
[null,null,null,null,null,{"$f":"Übersicht!J12","v":0.3},{"$f":"F14*G14+F19*G19","v":1}]
{"$rows_left_out":32}
{"sheet":"1B","index":4,"n_rows":52,"n_cols":23,"rows_kept":52,"cut":false,"hidden":false,"merged":[[1,2,1,24],[49,7,49,9],[51,0,51,2],[47,1,47,2],[49,0,49,2],[50,0,50,2],[7,0,8,2],[4,8,4,9],[15,16,18,18],[26,19,30,21],[22,4,32,4],[22,5,24,6],[26,5,30,6],[26,7,30,9],[26,10,30,12],[22,7,24,9],[22,10,24,12],[22,13,24,15],[5,0,5,1],[5,2,5,5],[15,19,18,21],[10,19,13,21],[10,13,13,15],[15,13,18,15],[10,7,13,9],[5,8,5,9],[5,10,5,11],[5,13,5,14],[7,16,7,18],[10,4,20,4],[10,5,13,6],[15,5,18,6],[34,4,47,4],[40,22,40,24],[46,22,46,24],[41,22,45,24],[34,19,39,21],[41,19,45,21],[34,16,39,18],[34,5,39,6],[34,22,39,24],[41,5,45,6],[41,7,45,9],[41,10,45,12],[41,13,45,15],[41,16,45,18],[34,7,39,9],[34,10,39,12],[15,7,18,9],[15,10,18,12],[7,4,8,4],[7,5,8,5],[7,7,7,9],[7,10,7,12],[7,13,7,15],[19,22,19,24],[8,22,8,24],[4,10,4,11],[4,13,4,14],[15,22,18,24],[34,13,39,15],[26,13,30,15],[49,10,51,12],[25,22,25,24],[7,22,7,24],[10,22,13,24],[22,22,24,24],[14,22,14,24],[22,16,24,18],[22,19,24,21],[10,10,13,12],[7,19,7,21],[10,16,13,18],[31,22,31,24],[26,16,30,18],[26,22,30,24]]}
[]
["Übersicht",null,"Prüfungsteil B: Schreiben mit der integrierten Teilkompetenz Leseverstehen"]
[]
[]
["Auswahlaufgabe (Bitte auswählen)",null,null,null,null,null,"Gewichtung",null,"Vorname",null,"Name",null,null,"Klausurdatum"]
["Fiktionaler Text",null,{"$f":"IF('1B'!$A$6=\"Fiktionaler Text\",Übersicht!$K$6,Übersicht!$K$7)","v":0},null,null,null,{"$f":"Übersicht!AC12","v":0.55000000000000004},null,{"$f":"IF(Übersicht!C15=\"\",\"\",Übersicht!C15)","v":""},null,{"$f":"IF(Übersicht!D15=\"\",\"\",Übersicht!D15)","v":""},null,null,{"$f":"IF(Übersicht!Z4=\"\",\"\",Übersicht!Z4)","v":""}]
[]
["Inhalt Auswahlaufgabe 1\r\nFiktionaler Text",null,null,null,"Aspekt","Gewicht","Note","sehr gut",null,null,"gut",null,null,"befriedigend",null,null,"ausreichend",null,null,"mangelhaft",null,null,"ungenügend"]
[null,null,null,null,null,null,"Punkte",15,14,13,12,11,10,9,8,7,6,5,4,3,2,1,0]
[]
[null,null,null,null,"Wortebene","Allgemeiner Wortschatz",null,"sehr differenziert, treffsicher und umfangreich, sehr hoher Grad an Korrektheit",null,null,"differenziert und meist treffend, hoher Grad an Korrektheit",null,null,"weniger differenziert bei vermehrter Fehlerzahl",null,null,"begrenzt, teils ungenau, recht hohe Fehlerzahl",null,null,"deutlich begrenzt, Verständlichkeit beeinträchtigt, hohe Fehlerzahl",null,null,"stark begrenzt,  Verständlichkeit erheblich beeinträchtigt, sehr hohe Fehlerzahl"]
[]
[]
[]
[null,null,null,null,null,{"$f":"Übersicht!H12","v":0.5},{"$f":"PUnkte(H15:Y15)","v":1},null,null,null,null,null,null,null,null,null,null,null,null,null,null,"x"]
[null,null,null,null,null,"Fachwortschatz, Funktionswortschatz",null,"sehr differenziert, treffsicher und umfangreich, sehr hoher Grad an Korrektheit",null,null,"differenziert und meist treffend, hoher Grad an Korrektheit",null,null,"weniger differenziert bei vermehrter Fehlerzahl",null,null,"begrenzt, teils ungenau, recht hohe Fehlerzahl",null,null,"deutlich begrenzt, Verständlichkeit beeinträchtigt, hohe Fehlerzahl",null,null,"stark begrenzt,  Verständlichkeit erheblich beeinträchtigt, sehr hohe Fehlerzahl"]
[]
[]
[]
[null,null,null,null,null,{"$f":"Übersicht!I12","v":0.5},{"$f":"PUnkte(H20:Y20)","v":1},null,null,null,null,null,null,null,null,null,null,null,null,null,null,"x"]
{"$rows_left_out":32}